validity period
type: ObjectProperty
comment: added from BSP (per-class property assessment)
definition: A period of validity specified for this referenced document.
domain includes: AllowanceCharge
range includes: Period
term status: proposed