used transport means
type: ObjectProperty
comment: added from BSP (default-keep re-triage)
definition: The means of transport used for this logistics transport movement.
domain includes: TransportMovement
range includes: TransportMeans
term status: proposed