nanomole
type: Concept
definition: An SI unit of amount of substance equal to 10−9 moles
in scheme: unit-of-measure
notation: Z9
conversion multiplier: 1e-09
dimension vector: N1
rec20 quantity: amount of substance
rec20 sector: Physical Chemistry and Molecular Physics
unit symbol: nmol