Gunter's chain
type: Concept
definition: A unit of distance used or formerly used by British surveyors.
in scheme: unit-of-measure
notation: X1
conversion multiplier: 20.1168
dimension vector: L1
rec20 quantity: length, breadth, height, thickness, radius, radius of curvature, cartesian coordinates, diameter, length of path, distance
rec20 sector: Space and Time
ucum code: [ch_br]
unit symbol: ch (UK)