Joule per normalised cubic metre
type: Concept
definition: Joule per normalised cubic metre (temperature 0°C and pressure 101325 millibars).
in scheme: unit-of-measure
notation: Q41
rec20 sector: Mechanics