Standard cubic metre per hour
type: Concept
definition: Standard cubic metre (temperature 15°C and pressure 101325 millibars ) per hour
in scheme: unit-of-measure
notation: Q38
rec20 quantity: volume flow rate
rec20 sector: Mechanics