Standard cubic metre per day
type: Concept
definition: Standard cubic metre (temperature 15°C and pressure 101325 millibars ) per day
in scheme: unit-of-measure
notation: Q37
rec20 quantity: volume flow rate
rec20 sector: Mechanics