pH (potential of Hydrogen)
type: Concept
definition: The activity of the (solvated) hydrogen ion (a logarithmic measure used to state the acidity or alkalinity of a chemical solution).
in scheme: unit-of-measure
notation: Q30
rec20 quantity: acidity and alkalinity
rec20 sector: Physical Chemistry and Molecular Physics
unit symbol: pH