millisievert per minute
type: Concept
definition: 0,001-fold of the derived SI unit sievert divided by the unit minute.
in scheme: unit-of-measure
notation: P75
conversion multiplier: 1.6666666666666667e-05
dimension vector: L2 T-3
rec20 quantity: equivalence dose output
rec20 sector: Nuclear Reactions and Ionizing Radiations
ucum code: mSv.min-1
unit symbol: mSv/min