sievert per hour
type: Concept
definition: Derived SI unit sievert divided by the unit hour.
in scheme: unit-of-measure
notation: P70
conversion multiplier: 0.0002777777777777778
dimension vector: L2 T-3
rec20 quantity: equivalence dose output
rec20 sector: Nuclear Reactions and Ionizing Radiations
ucum code: Sv.h-1
unit symbol: Sv/h