microsievert per second
type: Concept
definition: 0,000 001-fold of the derived SI unit sievert divided by the SI base unit second.
in scheme: unit-of-measure
notation: P67
conversion multiplier: 1e-06
dimension vector: L2 T-3
rec20 quantity: equivalence dose output
rec20 sector: Nuclear Reactions and Ionizing Radiations
ucum code: uSv.s-1
unit symbol: µSv/s