milligray per hour
type: Concept
definition: 0,001-fold of the derived SI unit gray divided by the unit hour.
in scheme: unit-of-measure
notation: P62
conversion multiplier: 2.7777777777777776e-07
dimension vector: L2 T-3
rec20 quantity: absorbed dose rate
rec20 sector: Nuclear Reactions and Ionizing Radiations
ucum code: mGy.h-1
unit symbol: mGy/h