gray per hour
type: Concept
definition: SI derived unit gray divided by the unit hour.
in scheme: unit-of-measure
notation: P61
conversion multiplier: 0.0002777777777777778
dimension vector: L2 T-3
rec20 quantity: absorbed dose rate
rec20 sector: Nuclear Reactions and Ionizing Radiations
ucum code: Gy.h-1
unit symbol: Gy/h