microgray per minute
type: Concept
definition: 0,000 001-fold of the derived SI unit gray divided by the unit minute.
in scheme: unit-of-measure
notation: P59
conversion multiplier: 1.6666666666666667e-08
dimension vector: L2 T-3
rec20 quantity: absorbed dose rate
rec20 sector: Nuclear Reactions and Ionizing Radiations
ucum code: uGy.min-1
unit symbol: µGy/min