milligray per second
type: Concept
definition: 0,001-fold of the derived SI unit gray divided by the SI base unit second.
in scheme: unit-of-measure
notation: P54
conversion multiplier: 0.001
dimension vector: L2 T-3
rec20 quantity: absorbed dose rate
rec20 sector: Nuclear Reactions and Ionizing Radiations
ucum code: mGy.s-1
unit symbol: mGy/s