unit pole
type: Concept
definition: CGS (Centimetre-Gram-Second system) unit for magnetic flux of a magnetic pole (according to the interaction of identical poles of 1 dyn at a distance of a cm).
in scheme: unit-of-measure
notation: P53
conversion multiplier: 1.256637e-07
dimension vector: I-1 L2 M1 T-2
rec20 quantity: magnetic flux quantum
rec20 sector: Solid State Physics
unit symbol: unit pole