weber metre
type: Concept
definition: Product of the derived SI unit weber and SI base unit metre.
in scheme: unit-of-measure
notation: P50
conversion multiplier: 1.0
dimension vector: I-1 L3 M1 T-2
rec20 quantity: magnetic dipole moment
rec20 sector: Physical Chemistry and Molecular Physics
ucum code: Wb.m
unit symbol: Wb·m