pound mole per pound
type: Concept
definition: Non SI-conforming unit of the material molar flux divided by the avoirdupois pound for mass according to the avoirdupois unit system.
in scheme: unit-of-measure
notation: P48
conversion multiplier: 1000.0
dimension vector: N1 M-1
rec20 quantity: ionic strength
rec20 sector: Physical Chemistry and Molecular Physics
ucum code: [mol_lb].[lb_av]-1
unit symbol: lbmol/lb