pound mole per minute
type: Concept
definition: Non SI-conforming unit of the power of the amount of substance non-SI compliant unit of the molar flux relating that a pound mole of a chemical composition the same number of pound corresponds like the molecular weight of a molecule of this composition in atomic mass units.
in scheme: unit-of-measure
notation: P46
conversion multiplier: 7.559872833333333
dimension vector: N1 T-1
rec20 quantity: catalytic activity
rec20 sector: Physical Chemistry and Molecular Physics
ucum code: [mol_lb].min-1
unit symbol: lbmol/h