bel per metre
type: Concept
definition: Unit bel divided by the SI base unit metre.
in scheme: unit-of-measure
notation: P43
dimension vector: L-1
rec20 quantity: sound pressure level, sound power level
rec20 sector: Acoustics
ucum code: B.m-1
unit symbol: B/m