pascal squared second
type: Concept
definition: Unit of the set as a product of the power of derived SI unit pascal with exponent 2 and the SI base unit second.
in scheme: unit-of-measure
notation: P42
conversion multiplier: 1.0
dimension vector: L-2 M2 T-3
rec20 quantity: sound exposure
rec20 sector: Acoustics
ucum code: Pa2.s
unit symbol: Pa²·s