langley
type: Concept
definition: CGS (Centimetre-Gram-Second system) unit of the areal-related energy transmission (as a measure of the incident quantity of heat of solar radiation on the earth's surface).
in scheme: unit-of-measure
notation: P40
dimension vector: M1 T-2
rec20 quantity: radiant energy fluence, radiance exposure
rec20 sector: Light and Related Electromagnetic Radiations
unit symbol: Ly