candela per square foot
type: Concept
definition: Base unit SI candela divided by the power of the unit foot according to the Anglo-American and Imperial system of units by exponent 2.
in scheme: unit-of-measure
notation: P32
conversion multiplier: 10.763910416709722
dimension vector: L-2 J1
rec20 quantity: luminance
rec20 sector: Light and Related Electromagnetic Radiations
ucum code: cd.[ft_i]-2
unit symbol: cd/ft²