candela per square inch
type: Concept
definition: SI base unit candela divided by the power of unit inch according to the Anglo-American and Imperial system of units by exponent 2.
in scheme: unit-of-measure
notation: P28
conversion multiplier: 1550.0031000062002
dimension vector: L-2 J1
rec20 quantity: luminance
rec20 sector: Light and Related Electromagnetic Radiations
ucum code: cd.[in_i]-2
unit symbol: cd/in²