kilojoule per hour
type: Concept
definition: Quotient from the 1000-fold of the derived SI unit joule divided by the unit hour.
in scheme: unit-of-measure
notation: P20
conversion multiplier: 0.2777777777777778
dimension vector: L2 M1 T-3
rec20 quantity: power (for direct current), active power
rec20 sector: Electricity and Magnetism
ucum code: kJ.h-1
unit symbol: kJ/h