joule per hour
type: Concept
definition: Quotient from the derived SI unit joule divided by the unit hour.
in scheme: unit-of-measure
notation: P16
conversion multiplier: 277777.77777777775
dimension vector: L2 M1 T-3
rec20 quantity: power (for direct current), active power
rec20 sector: Electricity and Magnetism
ucum code: GJ.h-1
unit symbol: J/h