coulomb per metre
type: Concept
definition: Derived SI unit coulomb divided by the SI base unit metre.
in scheme: unit-of-measure
notation: P10
conversion multiplier: 1.0
dimension vector: I1 L-1 T1
rec20 quantity: lineic charge
rec20 sector: Electricity and Magnetism
ucum code: C.m-1
unit symbol: C/m