Normalised cubic metre
type: Concept
definition: Normalised cubic metre (temperature 0°C and pressure 101325 millibars )
in scheme: unit-of-measure
notation: NM3
rec20 quantity: volume
rec20 sector: Space and Time