picovolt
type: Concept
definition: 0,000 000 000 001-fold of the derived SI unit volt.
in scheme: unit-of-measure
notation: N99
conversion multiplier: 1e-12
dimension vector: I-1 L2 M1 T-3
rec20 quantity: electric potential, potential difference, tension, voltage, electromotive force
rec20 sector: Electricity and Magnetism
unit symbol: pV