ampere minute
type: Concept
definition: A unit of electric charge defining the amount of charge accumulated by a steady flow of one ampere for one minute..
in scheme: unit-of-measure
notation: N95
conversion multiplier: 60.0
dimension vector: I1 T1
rec20 quantity: electric charge, quantity of electricity, electric flux (flux of displacement)
rec20 sector: Electricity and Magnetism
ucum code: A.min
unit symbol: A·min