reciprocal joule
type: Concept
definition: Reciprocal of the derived SI unit joule.
in scheme: unit-of-measure
notation: N91
conversion multiplier: 1.0
dimension vector: L-2 M-1 T2
rec20 quantity: coefficient, performance characteristic
rec20 sector: Electricity and Magnetism
ucum code: /J
unit symbol: 1/J