degree Fahrenheit hour per British thermal unit (thermochemical)
type: Concept
definition: Non SI-conforming unit of the thermal resistance according to the Imperial system of units.
in scheme: unit-of-measure
notation: N85
conversion multiplier: 1.8969028294866048
dimension vector: L-2 M-1 Θ1 T3
rec20 quantity: thermal resistance
rec20 sector: Heat
ucum code: [degF].h.[Btu_th]-1
unit symbol: ºF/(Btuth/h)