metre per degree Celcius metre
type: Concept
definition: SI base unit metre divided by the product of the unit degree Celsius and the SI base unit metre.
in scheme: unit-of-measure
notation: N83
conversion multiplier: 1.0
dimension vector: Θ-1
rec20 quantity: thermal diffusivity
rec20 sector: Heat
ucum code: m.Cel-1.m-1
unit symbol: m/(°C·m)