kilowatt per metre kelvin
type: Concept
definition: 1000-fold of the derived SI unit watt divided by the product of the SI base unit metre and the SI base unit kelvin.
in scheme: unit-of-measure
notation: N81
conversion multiplier: 1000.0
dimension vector: L1 M1 Θ-1 T-3
rec20 quantity: thermal conductivity
rec20 sector: Heat
ucum code: kW.m-1.K-1
unit symbol: kW/(m·K)