kelvin per pascal
type: Concept
definition: SI base unit kelvin divided by the derived SI unit pascal.
in scheme: unit-of-measure
notation: N79
conversion multiplier: 1.0
dimension vector: L1 M-1 Θ1 T2
rec20 quantity: temperature
rec20 sector: Heat
ucum code: K.Pa-1
unit symbol: K/Pa