British thermal unit (international table) per hour square foot degree Fahrenheit
type: Concept
definition: Unit of the heat transition coefficient according to the Imperial system of units.
in scheme: unit-of-measure
notation: N74
conversion multiplier: 5.678263341113487
dimension vector: M1 Θ-1 T-3
rec20 quantity: surface coefficient of heat transfer
rec20 sector: Heat
ucum code: [Btu_IT].h-1.[ft_i]-2.[degF]-1
unit symbol: BtuIT/(h·ft²·ºF)