kilocalorie (international table) per gram kelvin
type: Concept
definition: Unit of the mass-related heat capacity as quotient 1000-fold of the calorie (international table) divided by the product of the 0,001-fold of the SI base units kilogram and kelvin.
in scheme: unit-of-measure
notation: N65
conversion multiplier: 4186800.0
dimension vector: L2 Θ-1 T-2
rec20 quantity: heat capacity, entropy
rec20 sector: Heat
ucum code: kcal_IT.g-1.K-1
unit symbol: (kcalIT/K)/g