British thermal unit (thermochemical) per degree Rankine
type: Concept
definition: Unit of the heat capacity according to the Imperial system of units.
in scheme: unit-of-measure
notation: N63
conversion multiplier: 1897.8304761
dimension vector: L2 M1 Θ-1 T-2
rec20 quantity: heat capacity, entropy
rec20 sector: Heat
ucum code: [Btu_th].[degR]-1
unit symbol: Btuth/ºR