calorie (thermochemical) per square centimetre minute
type: Concept
definition: Unit of the surface heat flux according to the Imperial system of units.
in scheme: unit-of-measure
notation: N56
conversion multiplier: 697.3333333333334
dimension vector: M1 T-3
rec20 quantity: density of heat flow rate
rec20 sector: Heat
ucum code: cal_th.cm-2.min-1
unit symbol: calth/(cm²·min)