British thermal unit (international table) per square foot hour
type: Concept
definition: Unit of the surface heat flux according to the Imperial system of units.
in scheme: unit-of-measure
notation: N50
conversion multiplier: 3.154590745063049
dimension vector: M1 T-3
rec20 quantity: density of heat flow rate
rec20 sector: Heat
ucum code: [Btu_IT].[ft_i]-2.h-1
unit symbol: BtuIT/(ft²·h)