watt per square inch
type: Concept
definition: Derived SI unit watt divided by the power of the unit inch according to the Anglo-American and Imperial system of units by exponent 2.
in scheme: unit-of-measure
notation: N49
conversion multiplier: 1550.0031
dimension vector: M1 T-3
rec20 quantity: density of heat flow rate
rec20 sector: Heat
ucum code: W.[sin_i]-1
unit symbol: W/in²