watt per square centimetre
type: Concept
definition: Derived SI unit watt divided by the power of the 0,01-fold the SI base unit metre by exponent 2.
in scheme: unit-of-measure
notation: N48
conversion multiplier: 10000.0
dimension vector: M1 T-3
rec20 quantity: density of heat flow rate
rec20 sector: Heat
ucum code: W.cm-2
unit symbol: W/cm²