cubic metre per second pascal
type: Concept
definition: Power of the SI base unit meter by exponent 3 divided by the product of the SI base unit second and the derived SI base unit pascal.
in scheme: unit-of-measure
notation: N45
conversion multiplier: 1.0
dimension vector: L4 M-1 T1
rec20 quantity: volume flow rate
rec20 sector: Mechanics
ucum code: m3.s-1.Pa-1
unit symbol: (m³/s)/Pa