pound per foot day
type: Concept
definition: Unit of the dynamic viscosity according to the Anglo-American unit system.
in scheme: unit-of-measure
notation: N44
conversion multiplier: 1.722412e-05
dimension vector: L-1 M1 T-1
rec20 quantity: viscosity (dynamic viscosity)
rec20 sector: Mechanics
ucum code: [lb_av].[ft_i]-1.d-1
unit symbol: lb/(ft·d)