pound per foot minute
type: Concept
definition: Unit of the dynamic viscosity according to the Anglo-American unit system.
in scheme: unit-of-measure
notation: N43
conversion multiplier: 0.024802732392825898
dimension vector: L-1 M1 T-1
rec20 quantity: viscosity (dynamic viscosity)
rec20 sector: Mechanics
ucum code: [lb_av].[ft_i]-1.min-1
unit symbol: lb/(ft·min)