poundal second per square inch
type: Concept
definition: Non SI-conforming unit of dynamic viscosity according to the Imperial system of units as product unit of the pressure (poundal by square inch) multiplied by the SI base unit second.
in scheme: unit-of-measure
notation: N42
conversion multiplier: 214.29560787401576
dimension vector: L-1 M1 T-1
rec20 quantity: viscosity (dynamic viscosity)
rec20 sector: Mechanics
ucum code: [lb_av].[ft_i].s-2.s.[in_i]-2
unit symbol: (pdl/in²)·s