gram per centimetre second
type: Concept
definition: Unit of the dynamic viscosity as a quotient of the 0,001-fold of the SI base unit kilogram divided by the 0,01-fold of the SI base unit metre and SI base unit second.
in scheme: unit-of-measure
notation: N41
conversion multiplier: 0.1
dimension vector: L-1 M1 T-1
rec20 quantity: viscosity (dynamic viscosity)
rec20 sector: Mechanics
ucum code: g.cm-1.s-1
unit symbol: g/(cm·s)