kilogram per metre hour
type: Concept
definition: Unit of the dynamic viscosity as a quotient SI base unit kilogram divided by the SI base unit metre and by the unit hour.
in scheme: unit-of-measure
notation: N40
conversion multiplier: 0.000277777777777778
dimension vector: L-1 M1 T-1
rec20 quantity: viscosity (dynamic viscosity)
rec20 sector: Mechanics
ucum code: kg.m-1.h-1
unit symbol: kg/(m·h)