poise per pascal
type: Concept
definition: CGS (Centimetre-Gram-Second system) unit poise divided by the derived SI unit pascal.
in scheme: unit-of-measure
notation: N35
conversion multiplier: 0.1
dimension vector: T1
rec20 quantity: viscosity (dynamic viscosity)
rec20 sector: Mechanics
ucum code: P.Pa-1
unit symbol: P/Pa