pound-force per yard
type: Concept
definition: Unit of force per unit length based on the Anglo-American system of units.
in scheme: unit-of-measure
notation: N33
conversion multiplier: 4.864634530666167
dimension vector: M1 T-2
rec20 quantity: surface tension
rec20 sector: Mechanics
ucum code: [lbf_av].[yd_i]-1
unit symbol: lbf/yd